{"text_format":"1","workbook":"xlsx","n_sheets":16,"sheets":["Instructions","Glossary","Demand Curve Results","Model-->","Model","Multiple Scenario Output","Data Updated Annually-->","Escalation Factor","Winter-to-Summer Ratio","Net EAS","Fixed Inputs-->","Levelized Factor","Peak Load and IRM","AS Adders","Performance and O&M","Capital Costs"],"not_rendered":{"charts":0,"images":0,"macros":1,"external_links":0,"defined_names":78,"comments":0,"pivot_tables":0},"unopened":[],"bounds":{"document_bytes":16777216,"sheet_cells":100000,"rows_first":2000,"rows_last":500,"rows_between":2000,"halvings":0,"cell_chars":16384,"cell_head_chars":4096},"cells_cut":0,"cells_raw":0,"read":"whole","date_system":"1900"}

{"sheet":"Instructions","index":0,"n_rows":14,"n_cols":4,"rows_kept":14,"cut":false,"hidden":false,"merged":[[1,3,1,4]]}
[null,"Project: ",null,"NYISO ICAP Demand Curve "]
[null,"Date: ",null,"2021-04-12"]
[null,"Worksheet:",null,"Instructions"]
[]
[null,"Instructions for Using NYISO ICAP Demand Curve Workbook"]
[]
[]
[null,"Steps:"]
[]
[null,1,"Collect index information from BLS and BEA websites and update Escalation Factor in \"Escalation Factor\" Worksheet"]
[null,2,"Update Net EAS Revenues in \"Net EAS\" Worksheet"]
[null,3,"Update Winter-Summer Ratio in \"Winter-Summer Ratio\" Worksheet "]
[null,4,"Save Previous DCR values in \"Demand Curve Results\" Worksheet"]
[null,5,"Update and run DCR model, using \"Multiple Scenario Output\" Worksheet"]

{"sheet":"Glossary","index":1,"n_rows":50,"n_cols":3,"rows_kept":50,"cut":false,"hidden":false,"merged":[[1,2,1,3]]}
[null,"Project: ","NYISO ICAP Demand Curve "]
[null,"Date: ","2021-04-12"]
[null,"Worksheet:","Glossary"]
[]
[null,"Glossary of Named Ranges"]
[]
[]
[null,"Named Range","Name"]
[null,"Annual_Reference_Value","Annual Reference Value ($/kW-Year)"]
[null,"ATWACC","After Tax Weighted Average Cost of Capital (%)"]
[null,"ATWACC_Real","After Tax Weighted Average Cost of Capital (Real, %)"]
[null,"Capability_Year","Capability Year"]
[null,"Capacity_at_LOE","Capacity at LOE Conditions (%)"]
[null,"Capital_Costs","Overnight Capital Costs ($/kW-Year)"]
[null,"CC_Flag","CC Plant Flag"]
[null,"Debt_Fraction","Debt Fraction (%)"]
[null,"Debt_Rate","Debt Rate (%)"]
[null,"Debt_Rate_Real","Debt Rate (Real, %)"]
[null,"DMNC_ICAP","DMNC ICAP (MW)"]
[null,"DMNC_Summer","DMNC Summer (MW)"]
{"$rows_left_out":31}
{"sheet":"Demand Curve Results","index":2,"n_rows":103,"n_cols":17,"rows_kept":103,"cut":false,"hidden":false,"merged":[[10,4,10,8],[46,3,46,8],[75,3,75,8]]}
[null,null,null,"Project: ",null,"NYISO ICAP Demand Curve "]
[null,null,null,"Date: ",null,"2021-04-12"]
[null,null,null,"Worksheet:",null,"Demand Curve Results"]
[]
[null,null,null,"Instructions:",null,"Current ICAP Demand Curve Parameters are linked to \"Multiple Scenario Output\" Table."]
[null,null,null,null,null,"Before completing an annual update, copy values from \"Current Parameters\" section and paste values into \"Historical Values\" section to save results from previous years."]
[]
[null,null,null,"Current ICAP Demand Curve Parameters"]
[]
[]
[null,null,null,null,{"$f":"\"Current Year (\"&Capability_Year&\")\"","v":"Current Year (2021-2022)"}]
[null,null,null,null,null,"C - Central","G - Hudson Valley (Rockland)","J - New York City","K - Long Island"]
[null,null,null,null,"Source","C - Central","G - Hudson Valley (Rockland)","J - New York City","K - Long Island"]
["Gross CONE ($/kW-Year)",null,null,"Gross Cost of New Entry ($/kW-Year)","[1]",{"$f":"INDEX('Multiple Scenario Output'!$A$31:$AM$36, MATCH(F$12,'Multiple Scenario Output'!$C$31:$C$36, 0), MATCH($A14, 'Multiple Scenario Output'!$A$31:$AM$31, 0))","v":107.0668},{"$f":"INDEX('Multiple Scenario Output'!$A$31:$AM$36, MATCH(G$12,'Multiple Scenario Output'!$C$31:$C$36, 0), MATCH($A14, 'Multiple Scenario Output'!$A$31:$AM$31, 0))","v":139.6283},{"$f":"INDEX('Multiple Scenario Output'!$A$31:$AM$36, MATCH(H$12,'Multiple Scenario Output'!$C$31:$C$36, 0), MATCH($A14, 'Multiple Scenario Output'!$A$31:$AM$31, 0))","v":188.53210000000001},{"$f":"INDEX('Multiple Scenario Output'!$A$31:$AM$36, MATCH(I$12,'Multiple Scenario Output'!$C$31:$C$36, 0), MATCH($A14, 'Multiple Scenario Output'!$A$31:$AM$31, 0))","v":148.96539999999999}]
["Net EAS ($/kW-Year)",null,null,"Net EAS Revenue ($/kW-Year)","[2]",{"$f":"INDEX('Multiple Scenario Output'!$A$31:$AM$36, MATCH(F$12,'Multiple Scenario Output'!$C$31:$C$36, 0), MATCH($A15, 'Multiple Scenario Output'!$A$31:$AM$31, 0))","v":32.915999999999997},{"$f":"INDEX('Multiple Scenario Output'!$A$31:$AM$36, MATCH(G$12,'Multiple Scenario Output'!$C$31:$C$36, 0), MATCH($A15, 'Multiple Scenario Output'!$A$31:$AM$31, 0))","v":35.151299999999999},{"$f":"INDEX('Multiple Scenario Output'!$A$31:$AM$36, MATCH(H$12,'Multiple Scenario Output'!$C$31:$C$36, 0), MATCH($A15, 'Multiple Scenario Output'!$A$31:$AM$31, 0))","v":33.416699999999999},{"$f":"INDEX('Multiple Scenario Output'!$A$31:$AM$36, MATCH(I$12,'Multiple Scenario Output'!$C$31:$C$36, 0), MATCH($A15, 'Multiple Scenario Output'!$A$31:$AM$31, 0))","v":54.146099999999997}]
["Annual Reference Value ($/kW-Year)",null,null,"Annual ICAP Reference Value ($/kW-Year)","[3] = [1] - [2]",{"$f":"INDEX('Multiple Scenario Output'!$A$31:$AM$36, MATCH(F$12,'Multiple Scenario Output'!$C$31:$C$36, 0), MATCH($A16, 'Multiple Scenario Output'!$A$31:$AM$31, 0))","v":74.150700000000001},{"$f":"INDEX('Multiple Scenario Output'!$A$31:$AM$36, MATCH(G$12,'Multiple Scenario Output'!$C$31:$C$36, 0), MATCH($A16, 'Multiple Scenario Output'!$A$31:$AM$31, 0))","v":104.477},{"$f":"INDEX('Multiple Scenario Output'!$A$31:$AM$36, MATCH(H$12,'Multiple Scenario Output'!$C$31:$C$36, 0), MATCH($A16, 'Multiple Scenario Output'!$A$31:$AM$31, 0))","v":155.11539999999999},{"$f":"INDEX('Multiple Scenario Output'!$A$31:$AM$36, MATCH(I$12,'Multiple Scenario Output'!$C$31:$C$36, 0), MATCH($A16, 'Multiple Scenario Output'!$A$31:$AM$31, 0))","v":94.819299999999998}]
[]
["DMNC ICAP (MW)",null,null,"ICAP DMNC (MW)","[4]",{"$f":"INDEX('Multiple Scenario Output'!$A$31:$AM$36, MATCH(F$12,'Multiple Scenario Output'!$C$31:$C$36, 0), MATCH($A18, 'Multiple Scenario Output'!$A$31:$AM$31, 0))","v":326.7},{"$f":"INDEX('Multiple Scenario Output'!$A$31:$AM$36, MATCH(G$12,'Multiple Scenario Output'!$C$31:$C$36, 0), MATCH($A18, 'Multiple Scenario Output'!$A$31:$AM$31, 0))","v":347},{"$f":"INDEX('Multiple Scenario Output'!$A$31:$AM$36, MATCH(H$12,'Multiple Scenario Output'!$C$31:$C$36, 0), MATCH($A18, 'Multiple Scenario Output'!$A$31:$AM$31, 0))","v":348.8},{"$f":"INDEX('Multiple Scenario Output'!$A$31:$AM$36, MATCH(I$12,'Multiple Scenario Output'!$C$31:$C$36, 0), MATCH($A18, 'Multiple Scenario Output'!$A$31:$AM$31, 0))","v":348.8}]
[null,null,null,"Total Annual Reference Value","[5] = [3] * [4]",{"$f":"F16*1000*F18","v":24225033.689999998},{"$f":"G16*1000*G18","v":36253519},{"$f":"H16*1000*H18","v":54104251.520000003},33072971.840000004]
["Capacity at LOE Conditions",null,null,"Level of Excess (%)","[6]",{"$f":"INDEX('Multiple Scenario Output'!$A$31:$AM$36, MATCH(F$12,'Multiple Scenario Output'!$C$31:$C$36, 0), MATCH($A20, 'Multiple Scenario Output'!$A$31:$AM$31, 0))","v":1.0085078249072446},{"$f":"INDEX('Multiple Scenario Output'!$A$31:$AM$36, MATCH(G$12,'Multiple Scenario Output'!$C$31:$C$36, 0), MATCH($A20, 'Multiple Scenario Output'!$A$31:$AM$31, 0))","v":1.0245655021061202},{"$f":"INDEX('Multiple Scenario Output'!$A$31:$AM$36, MATCH(H$12,'Multiple Scenario Output'!$C$31:$C$36, 0), MATCH($A20, 'Multiple Scenario Output'!$A$31:$AM$31, 0))","v":1.0350937843152919},{"$f":"INDEX('Multiple Scenario Output'!$A$31:$AM$36, MATCH(I$12,'Multiple Scenario Output'!$C$31:$C$36, 0), MATCH($A20, 'Multiple Scenario Output'!$A$31:$AM$31, 0))","v":1.0645362070694531}]
{"$rows_left_out":84}
{"sheet":"Model-->","index":3,"n_rows":0,"n_cols":0,"rows_kept":0,"cut":false,"hidden":false,"merged":[]}

{"sheet":"Model","index":4,"n_rows":94,"n_cols":32,"rows_kept":94,"cut":false,"hidden":false,"merged":[[2,1,2,2],[85,4,85,9],[1,1,1,2]]}
["Project: ","NYISO ICAP Demand Curve "]
["Date:","2021-04-12"]
["Worksheet:","Model"]
[]
["Instructions:","Values highlighted in yellow can be toggled to the values on their right, in grey, to view the reference point price for different zones, peaking plant technologies, and fuel assumptions. "]
[]
["Notes:","1. Technology, Service Life and AFUDC automatically update to match unit type. Tax rates automatically update to match region."]
[null,"2. Changing toggle selections on this page will not interfere with or edit the data on the \"Multiple Scenario Output\" tab. "]
[]
[]
[]
["NYISO ICAP Demand Curve Model"]
[]
["Inputs"]
[]
["Timing"]
["Capability Year","2021-2022","2021-2022","2022-2023","2023-2024","2024-2025"]
[]
["Plant"]
["Region","G - Hudson Valley (Rockland)","C - Central","G - Hudson Valley (Rockland)","J - New York City","K - Long Island"]
{"$rows_left_out":75}
{"sheet":"Multiple Scenario Output","index":5,"n_rows":36,"n_cols":39,"rows_kept":36,"cut":false,"hidden":false,"merged":[[1,1,1,2]]}
["Project: ","NYISO ICAP Demand Curve "]
["Date: ","2021-04-12"]
["Worksheet:","Multiple Scenario Output"]
[]
["Instructions:","After updating the escalation factor, winter-summer ratios, and net EAS and after saving the previous year's demand curve results, update this sheet by completing the following steps:"]
[null,"In rows 33 - 36, update \"Capability Year\" to the current year (e.g. 2021-2022). "]
[null,"Click the \"Perform Runs\" button. "]
[null,"The values in the blue and purple sections should update here and flow through to the \"Demand Curve Results\" tab automatically. "]
[]
[]
[]
[]
[]
[]
[]
["Inputs (Current Parameters from \"Model\")"]
[]
[]
[{"$f":"COLUMN()","v":1},{"$f":"COLUMN()","v":2},{"$f":"COLUMN()","v":3},{"$f":"COLUMN()","v":4},{"$f":"COLUMN()","v":5},{"$f":"COLUMN()","v":6},{"$f":"COLUMN()","v":7},{"$f":"COLUMN()","v":8},{"$f":"COLUMN()","v":9},{"$f":"COLUMN()","v":10},{"$f":"COLUMN()","v":11},{"$f":"COLUMN()","v":12},null,{"$f":"COLUMN()","v":14},{"$f":"COLUMN()","v":15},{"$f":"COLUMN()","v":16},{"$f":"COLUMN()","v":17},{"$f":"COLUMN()","v":18},{"$f":"COLUMN()","v":19},{"$f":"COLUMN()","v":20},{"$f":"COLUMN()","v":21},{"$f":"COLUMN()","v":22},{"$f":"COLUMN()","v":23},{"$f":"COLUMN()","v":24},{"$f":"COLUMN()","v":25},{"$f":"COLUMN()","v":26},{"$f":"COLUMN()","v":27},{"$f":"COLUMN()","v":28},{"$f":"COLUMN()","v":29},{"$f":"COLUMN()","v":30},{"$f":"COLUMN()","v":31},{"$f":"COLUMN()","v":32},{"$f":"COLUMN()","v":33},null,{"$f":"COLUMN()","v":35},{"$f":"COLUMN()","v":36},{"$f":"COLUMN()","v":37},{"$f":"COLUMN()","v":38},{"$f":"COLUMN()","v":39}]
[null,"Adjustable Inputs",null,null,null,null,null,null,null,null,null,null,null,null,"Linked Inputs",null,null,null,null,null,null,null,null,null,null,null,null,null,null,null,null,null,null,null,"Results"]
{"$rows_left_out":17}
{"sheet":"Data Updated Annually-->","index":6,"n_rows":0,"n_cols":0,"rows_kept":0,"cut":false,"hidden":false,"merged":[]}

{"sheet":"Escalation Factor","index":7,"n_rows":189,"n_cols":21,"rows_kept":189,"cut":false,"hidden":false,"merged":[[140,3,140,7],[103,3,103,5],[104,3,104,7],[105,3,105,7],[106,3,106,7],[107,3,107,7],[108,3,108,7],[109,3,109,7],[110,3,110,7],[137,3,137,7],[138,3,138,7],[139,3,139,7],[79,3,79,7],[1,3,1,4],[75,3,75,4],[76,3,76,7],[77,3,77,7],[78,3,78,7],[23,2,24,3]]}
[null,null,"Project: ","NYISO ICAP Demand Curve "]
[null,null,"Date: ","2021-04-12"]
[null,null,"Worksheet:","Escalation Factor"]
[]
[null,null,"Instructions:","To update the escalation factor for each annual update, access updated data through the source links provided."]
[null,null,null,"If the source is the BLS, ensure that the Series ID provided on this worksheet matches the Series ID of the source of the index."]
[null,null,null,"If the source is the BEA (for the GDP Deflator), ensure that the table and line number match the information provided in this worksheet."]
[null,null,null,"Enter all currently available data from the index in the yellow cells."]
[]
[]
[null,null,"Calculation of Escalation Factor"]
[]
[]
[null,null,"Escalation Factor for Currently Selected Zone, Technology, and Capability Year"]
[null,null,"Zone:",{"$f":"Region","v":"G - Hudson Valley (Rockland)"}]
[null,null,"Technology:",{"$f":"Unit","v":"1x0 GE 7HA.02 25ppm"}]
[null,null,"Capability Year:",{"$f":"Capability_Year","v":"2021-2022"},null,null,null,null,"Linked to model. Values will update based on selected capability year."]
["Base year:",null,null,null,"Construction Labor Cost","Materials Cost","Gas and Steam Turbine Cost","GDP Deflator"]
[{"$f":"IF(Capability_Year=\"2021-2022\",2018,2020)","v":2018},null,"Base Year","[A]",{"$f":"INDEX($C$115:$S$130, MATCH(A19-1, $C$115:$C$130, 0), MATCH(\"Construction Labor Cost\", $C$115:$S$115, 0))","v":101108},{"$f":"INDEX($C$84:$S$98, MATCH(A19, $C$84:$C$98, 0), MATCH(\"Materials Index\", $C$84:$S$84, 0))","v":249.83333333333334},{"$f":"INDEX($C$145:$S$159, MATCH($A$19, $C$145:$C$159, 0), MATCH(\"Turbine Index\", $C$145:$S$145, 0))","v":228.03333333333333},{"$f":"INDEX($C$175:$S$189, MATCH(A19, $C$175:$C$189, 0), MATCH(\"GDP Deflator\", $C$175:$S$175, 0))","v":111.42400000000001}]
["Lookup year:",null,"Escalation Year","[B]",{"$f":"INDEX($C$115:$S$130, MATCH(A21-1, $C$115:$C$130, 0), MATCH(\"Construction Labor Cost\", $C$115:$S$115, 0))","v":107893},{"$f":"INDEX($C$84:$S$98, MATCH(A21, $C$84:$C$98, 0), MATCH(\"Materials Index\", $C$84:$S$84, 0))","v":253.4},{"$f":"INDEX($C$145:$S$159, MATCH($A$21, $C$145:$C$159, 0), MATCH(\"Turbine Index\", $C$145:$S$145, 0))","v":238.76666666666665},{"$f":"INDEX($C$175:$S$189, MATCH(A21, $C$175:$C$189, 0), MATCH(\"GDP Deflator\", $C$175:$S$175, 0))","v":112.755}]
{"$rows_left_out":170}
{"sheet":"Winter-to-Summer Ratio","index":8,"n_rows":27,"n_cols":6,"rows_kept":27,"cut":false,"hidden":false,"merged":[[1,2,1,3]]}
[null,"Project: ","NYISO ICAP Demand Curve "]
[null,"Date: ","2021-04-12"]
[null,"Worksheet:","Winter-to-Summer Ratio"]
[]
[null,"Instructions:","Update WSR annually for each zone."]
[null,null,"Paste updated WSR values into yellow cells next to the correct zone."]
[]
[null,"Annual Winter-to-Summmer Ratios"]
[]
[]
[null,"Zone","Capability Year","Lookup","Winter-to-Summer Ratio","Updated 9/02/2020"]
[null,"C - Central","2021-2022",{"$f":"B12&C12","v":"C - Central2021-2022"},1.038]
[null,"G - Hudson Valley (Rockland)","2021-2022","G - Hudson Valley (Rockland)2021-2022",1.0589999999999999]
[null,"J - New York City","2021-2022","J - New York City2021-2022",1.0760000000000001]
[null,"K - Long Island","2021-2022","K - Long Island2021-2022",1.073]
[null,"C - Central","2022-2023","C - Central2022-2023"]
[null,"G - Hudson Valley (Rockland)","2022-2023","G - Hudson Valley (Rockland)2022-2023"]
[null,"J - New York City","2022-2023","J - New York City2022-2023"]
[null,"K - Long Island","2022-2023","K - Long Island2022-2023"]
[null,"C - Central","2023-2024","C - Central2023-2024"]
{"$rows_left_out":8}
{"sheet":"Net EAS","index":9,"n_rows":29,"n_cols":15,"rows_kept":29,"cut":false,"hidden":false,"merged":[[1,11,1,12]]}
[null,null,null,null,null,null,null,null,null,null,"Project: ","NYISO ICAP Demand Curve "]
[null,null,null,null,null,null,null,null,null,null,"Date: ","2021-04-12"]
[null,null,null,null,null,null,null,null,null,null,"Worksheet:","Net EAS Revenues"]
[]
[null,null,null,null,null,null,null,null,null,null,"Instructions:","Current data reflect the most recent net EAS results from the Net EAS Revenues model."]
[null,null,null,null,null,null,null,null,null,null,null,"To update net EAS results for a future capability year, run Net EAS Model and copy and paste in net EAS values that correspond to capability year, fuel type, and load zone. "]
[]
[]
[null,null,null,null,null,null,null,null,null,null,"Annual Net EAS Revenue Estimates"]
[]
[]
[null,null,null,null,null,null,null,null,null,null,null,null,null,"Net EAS Revenues ($/kW-Year)"]
[null,"Unit Type","Lookups",null,null,null,null,"Gas Matrix","zone",null,"Zone","Technology","Capability Year","Dual fuel with SCR","Gas only without SCR"]
[null,"j15",{"$f":"$B14&\"_\"&$I14&\"_\"&\"Yes_No_\"&$H14","v":"j15_C_Yes_No_1"},{"$f":"$B14&\"_\"&$I14&\"_\"&\"Yes_Yes_\"&$H14","v":"j15_C_Yes_Yes_1"},{"$f":"$B14&\"_\"&$I14&\"_\"&\"No_No_\"&$H14","v":"j15_C_No_No_1"},{"$f":"$B14&\"_\"&$I14&\"_\"&\"No_Yes_\"&$H14","v":"j15_C_No_Yes_1"},{"$f":"$B14&\"_\"&$I14","v":"j15_C"},1,"C",{"$f":"K14&L14&M14","v":"C - Central1x0 GE 7HA.02 15ppm2021-2022"},"C - Central","1x0 GE 7HA.02 15ppm","2021-2022","-",30.12316591405002]
[null,"j25",{"$f":"$B15&\"_\"&$I15&\"_\"&\"Yes_No_\"&$H15","v":"j25_G2_Yes_No_1"},{"$f":"$B15&\"_\"&$I15&\"_\"&\"Yes_Yes_\"&$H15","v":"j25_G2_Yes_Yes_1"},{"$f":"$B15&\"_\"&$I15&\"_\"&\"No_No_\"&$H15","v":"j25_G2_No_No_1"},{"$f":"$B15&\"_\"&$I15&\"_\"&\"No_Yes_\"&$H15","v":"j25_G2_No_Yes_1"},{"$f":"$B15&\"_\"&$I15","v":"j25_G2"},1,"G2",{"$f":"K15&L15&M15","v":"G - Hudson Valley (Rockland)1x0 GE 7HA.02 25ppm2021-2022"},"G - Hudson Valley (Rockland)","1x0 GE 7HA.02 25ppm","2021-2022",32.30733551959797,"-"]
[null,"j25","j25_J_Yes_No_1","j25_J_Yes_Yes_1","j25_J_No_No_1","j25_J_No_Yes_1","j25_J",1,"J",{"$f":"K16&L16&M16","v":"J - New York City1x0 GE 7HA.02 25ppm2021-2022"},"J - New York City","1x0 GE 7HA.02 25ppm","2021-2022",30.612338390535811,"-"]
[null,"j25","j25_K_Yes_No_1","j25_K_Yes_Yes_1","j25_K_No_No_1","j25_K_No_Yes_1","j25_K",1,"K","K - Long Island1x0 GE 7HA.02 25ppm2021-2022","K - Long Island","1x0 GE 7HA.02 25ppm","2021-2022",50.867667819761621,"-"]
[null,"j15",{"$f":"$B18&\"_\"&$I18&\"_\"&\"Yes_No_\"&$H18","v":"j15_C_Yes_No_1"},{"$f":"$B18&\"_\"&$I18&\"_\"&\"Yes_Yes_\"&$H18","v":"j15_C_Yes_Yes_1"},{"$f":"$B18&\"_\"&$I18&\"_\"&\"No_No_\"&$H18","v":"j15_C_No_No_1"},{"$f":"$B18&\"_\"&$I18&\"_\"&\"No_Yes_\"&$H18","v":"j15_C_No_Yes_1"},{"$f":"$B18&\"_\"&$I18","v":"j15_C"},1,"C",{"$f":"K18&L18&M18","v":"C - Central1x0 GE 7HA.02 15ppm2022-2023"},"C - Central","1x0 GE 7HA.02 15ppm","2022-2023"]
[null,"j25","j25_G2_Yes_No_1","j25_G2_Yes_Yes_1","j25_G2_No_No_1","j25_G2_No_Yes_1","j25_G2",1,"G2",{"$f":"K19&L19&M19","v":"G - Hudson Valley (Rockland)1x0 GE 7HA.02 25ppm2022-2023"},"G - Hudson Valley (Rockland)","1x0 GE 7HA.02 25ppm","2022-2023"]
[null,"j25","j25_J_Yes_No_1","j25_J_Yes_Yes_1","j25_J_No_No_1","j25_J_No_Yes_1","j25_J",1,"J","J - New York City1x0 GE 7HA.02 25ppm2022-2023","J - New York City","1x0 GE 7HA.02 25ppm","2022-2023"]
{"$rows_left_out":10}
{"sheet":"Fixed Inputs-->","index":10,"n_rows":0,"n_cols":0,"rows_kept":0,"cut":false,"hidden":false,"merged":[]}

{"sheet":"Levelized Factor","index":11,"n_rows":53,"n_cols":32,"rows_kept":53,"cut":false,"hidden":false,"merged":[[1,2,1,3]]}
[null,"Project: ","NYISO ICAP Demand Curve "]
[null,"Date: ","2021-04-12"]
[null,"Worksheet:","Levelized Factor"]
[]
[null,"Calculation of Levelized Factor"]
[]
[]
[null,"Input"]
[]
[null,"Property Tax Rate ",{"$f":"Property_Tax_Rate","v":5.0000000000000001E-3},"Linked to \"Model\""]
[null,"Total Project Capitalized Cost",{"$f":"Capital_Costs*DMNC_ICAP*1000","v":391252635.77069664}]
[]
[null,"Calendar"]
[null,"Operating Year",1,2,3,4,5,6,7,8,9,10,11,12,13,14,15,16,17,18,19,20,21,22,23,24,25,26,27,28,29,30]
[null,"Discount Rate Adjustment ",{"$f":"IF(C14<=Plant_Life,1/(1+ATWACC_Real)^(C14), 0)","v":0.9408263099635672},0.88515414551966232,0.83277630847821837,0.78349786133064347,0.7371354017400561,0.69351637996260873,0.65247845665951232,0.6138688987096923,0.57754401077443862,0.54336860049847391,0.51121547535704692,0.48096496927644139,0.45250449726609487,0.42572813640477913,0.40053623162137458,0.37683502480305053,0.35453630585048335,0.33355708438142495,0.31381928086078226,0.29524943600767006,0,0,0,0,0,0,0,0,0,0]
[]
[null,"Parameters and Exemptions"]
[null,"Loan Period Parameter",1,1,1,1,1,1,1,1,1,1,1,1,1,1,1,1,1,1,1,1,1,1,1,1,1,1,1,1,1,1]
[null,"NYC Property Tax Exemption active for 15 years",{"$f":"IF(AND(Region=\"J - New York City\",PropTax_Abate), 1, 0)","v":0},0,0,0,0,0,0,0,0,0,0,0,0,0,0,0,0,0,0,0,0,0,0,0,0,0,0,0,0,0]
[]
{"$rows_left_out":34}
{"sheet":"Peak Load and IRM","index":12,"n_rows":19,"n_cols":5,"rows_kept":19,"cut":false,"hidden":false,"merged":[[1,3,1,4]]}
[null,null,"Project: ","NYISO ICAP Demand Curve "]
[null,null,"Date: ","2021-04-12"]
[null,null,"Worksheet:","Peak Load and IRM"]
[]
[null,null,"Peak Load and IRM"]
[]
[]
[null,"Lookup","Zone","Peak Load (2020)","Installed Reserve Margin / \nLocational Capacity Requirement"]
[]
[null,"K","K - Long Island",5227,1.034]
[null,"J","J - New York City",11477,0.86599999999999999]
[null,"NYCA","NYCA",32296,1.1890000000000001]
[null,"G","G-J",15695,0.9]
[]
[]
[]
[null,null,"Sources:"]
[null,null,"2020 Gold Book, Tables I-3a, I-4a, and I-5."]
[null,null,"2020 - 2021 Locational Minimum Installed Capacity Requirement Study. NYISO."]

{"sheet":"AS Adders","index":13,"n_rows":8,"n_cols":3,"rows_kept":8,"cut":false,"hidden":false,"merged":[[1,4,1,5],[1,2,1,3]]}
[null,"Project: ","NYISO ICAP Demand Curve "]
[null,"Date: ","2021-04-12"]
[null,"Worksheet:","AS Adders"]
[]
[null,"AS Adders"]
[]
[null,"Adder Type","Adder ($/kW-Year)"]
[null,"VSS Adder",2.04]

{"sheet":"Performance and O&M","index":14,"n_rows":36,"n_cols":10,"rows_kept":36,"cut":false,"hidden":false,"merged":[[1,5,1,6]]}
[null,null,null,"Project: ",null,"NYISO ICAP Demand Curve "]
[null,null,null,"Date: ",null,"2021-04-12"]
[null,null,null,"Worksheet:",null,"Performance and O&M"]
[]
[null,null,null,"Performance and O&M Data"]
[]
[]
[null,null,null,null,null,"1x0 GE 7HA.02 25ppm","1x0 GE 7HA.02 25ppm","1x0 GE 7HA.02 25ppm",null,"1x0 GE 7HA.02 15ppm"]
[null,null,null,"Technology",null,"1x0 GE 7HA.02 25ppm dual fuel with SCR ",null,null,null,"1x0 GE 7HA.02 15ppm dual fuel without SCR "]
[null,null,null,"Plant Capacity (MW)",null,{"$f":"AVERAGE(F21:H21)","v":348.2},null,null,null,{"$f":"AVERAGE(J21:J21)","v":326.7}]
[]
[null,null,null,"Lookup",null,{"$f":"F13&F8","v":"G - Hudson Valley (Rockland)1x0 GE 7HA.02 25ppm"},{"$f":"G13&G8","v":"J - New York City1x0 GE 7HA.02 25ppm"},"K - Long Island1x0 GE 7HA.02 25ppm",null,{"$f":"J13&J8","v":"C - Central1x0 GE 7HA.02 15ppm"}]
[null,null,null,"Zone","Units","G - Hudson Valley (Rockland)","J - New York City","K - Long Island",null,"C - Central"]
[]
[null,null,null,"Plant Capacities"]
[]
[null,null,"Capacity- based on average temp (Summer, MW)","Net Plant Capacity - Summer","MW",357.4,358.7,359,null,338]
[null,null,"Capacity- based on average temp (Winter, MW)","Net Plant Capacity - Winer","MW",370.2,370.2,371.1,null,346.1]
[null,null,"DMNC Summer (MW)","DMNC Summer","MW",348.2,348.5,351.1,null,329.3]
[null,null,"DMNC Winter (MW)","DMNC Winter","MW",369.9,374.1,373,null,344.7]
{"$rows_left_out":17}
{"sheet":"Capital Costs","index":15,"n_rows":74,"n_cols":9,"rows_kept":74,"cut":false,"hidden":false,"merged":[[1,4,1,5]]}
[null,null,null,"Project: ","NYISO ICAP Demand Curve "]
[null,null,null,"Date: ","2021-04-12"]
[null,null,null,"Worksheet:","Capital Costs "]
[]
[null,null,null,"Capital Costs"]
[]
[]
[null,null,null,null,"1x0 GE 7HA.02 25ppm","1x0 GE 7HA.02 25ppm","1x0 GE 7HA.02 25ppm",null,"1x0 GE 7HA.02 15ppm"]
[null,null,null,null,"Dual fuel with SCR","Dual fuel with SCR","Dual fuel with SCR",null,"Gas only without SCR"]
[null,null,null,"Technology","1x0 GE 7HA.02 25ppm dual fuel with SCR ",null,null,null,"1x0 GE 7HA.02 15ppm gas only without SCR"]
[null,null,null,"Plant Capacity (MW) average of zone-specific DMNC ICAP",{"$f":"AVERAGE(E13:G13)","v":348.2},null,null,null,{"$f":"AVERAGE(I13:I13)","v":326.7}]
[]
[null,null,null,"DMNC ICAP (MW)",{"$f":"INDEX('Performance and O&M'!$C$12:$J$21, MATCH(\"DMNC ICAP (MW)\", 'Performance and O&M'!$C$12:$C$21, 0), MATCH(E15&E8, 'Performance and O&M'!$C$12:$J$12, 0))","v":347},{"$f":"INDEX('Performance and O&M'!$C$12:$J$21, MATCH(\"DMNC ICAP (MW)\", 'Performance and O&M'!$C$12:$C$21, 0), MATCH(F15&F8, 'Performance and O&M'!$C$12:$J$12, 0))","v":348.8},{"$f":"INDEX('Performance and O&M'!$C$12:$J$21, MATCH(\"DMNC ICAP (MW)\", 'Performance and O&M'!$C$12:$C$21, 0), MATCH(G15&G8, 'Performance and O&M'!$C$12:$J$12, 0))","v":348.8},null,{"$f":"INDEX('Performance and O&M'!$C$12:$J$21, MATCH(\"DMNC ICAP (MW)\", 'Performance and O&M'!$C$12:$C$21, 0), MATCH(I15&I8, 'Performance and O&M'!$C$12:$J$12, 0))","v":326.7}]
[null,null,null,"Lookup",{"$f":"E15&E8&E9","v":"G - Hudson Valley (Rockland)1x0 GE 7HA.02 25ppmDual fuel with SCR"},{"$f":"F15&F8&F9","v":"J - New York City1x0 GE 7HA.02 25ppmDual fuel with SCR"},{"$f":"G15&G8&G9","v":"K - Long Island1x0 GE 7HA.02 25ppmDual fuel with SCR"},null,{"$f":"I15&I8&I9","v":"C - Central1x0 GE 7HA.02 15ppmGas only without SCR"}]
[null,null,null,"Zone","G - Hudson Valley (Rockland)","J - New York City","K - Long Island",null,"C - Central"]
[]
[null,null,null,"EPC Costs"]
[null,null,null,"Labor ",72900000,99220000,96770000,null,39020000]
[null,null,null,"Materials",61860000,65190000,65300000,null,29530000]
[null,null,null,"Turbines or Batteries",68500000,68500000,68500000,null,67000000]
{"$rows_left_out":54}